ID,Idade,Genero,Cod Cidade,Cidade,Escolaridade,Isolamento social prejudicou acesso p/ prática de AF?,Possui comorbidade?,Qual comorbidade?,ANSIEDADE TRACO,ANSIEDADE ESTADO ANTES,ANSIEDADE ESTADO DURANTE,"Q1 - Nos últimos três meses, o(a) Sr.(a) praticava algum tipo de exercício físico ou esporte?",Q1B - Qual o tipo principal de exercício físico ou esporte que o(a) Sr.(a) praticava?,Q1C - O(a) Sr.(a) praticava o exercício pelo menos uma vez por semana?,Q1D - Quantos dias por semana o(a) Sr.(a) costumava praticar exercício físico ou esporte?,"Q1E - No dia que o(a) Sr.(a) praticava exercício ou esporte, quanto tempo durava esta atividade?","Q2 - Nos últimos três meses, o(a) Sr.(a) trabalhava?","Q2B - No seu trabalho, o(a) Sr.(a) andava bastante a pé?","Q2C - No seu trabalho, o(a) Sr.(a) carregava peso ou fazia outra atividade pesada?","Q2D - Em uma semana normal, em quantos dias o(a) Sr.(a) fazia essas atividades no seu trabalho?","Q2E - Quando realizava essas atividades, quanto tempo costumava durar? (minutos)","Q3 - Para ir ou voltar ao seu trabalho, fazia algum trajeto a pé ou de bicicleta?","Q3A-Sim, parte do trajeto","Q4 - Anteriormente, o(a) Sr.(a) estava frequentando algum curso/escola ou levava alguém em algum curso/escola?","Q4B - Para ir ou voltar a este curso ou escola, fazia algum trajeto a pé ou de bicicleta?",Q4C - Quanto tempo o(a) Sr.(a) gastava para ir e voltar neste trajeto (a pé ou de bicicleta)?,Q5 - Quem costumava fazer a faxina da sua casa?,Q5B - A parte mais pesada da faxina ficava com:,"Q5C - Em uma semana normal, em quantos dias o(a) Sr.(a) realizava faxina da sua casa?",Q5D - E quanto tempo costumava durar a faxina? (minutos),"Q6 - Em média, quantas horas por dia o(a) Sr.(a) costumava ficar assistindo à televisão?","Q6B - No seu TEMPO LIVRE, o(a) Sr.(a) costumava usar computador, tablet ou celular para participar de redes sociais do tipo Facebook, para ver filmes ou para se distrair com jogos?","Q6B - Em média, quantas horas do seu tempo livre (excluindo o trabalho), este uso do computador, tablet ou celular ocupava por dia?","Q1 - Nos últimos três meses, o(a) Sr.(a) praticava algum tipo de exercício físico ou esporte?.1",Q1B - Qual o tipo principal de exercício físico ou esporte que o(a) Sr.(a) praticava?.1,Q1C - O(a) Sr.(a) praticava o exercício pelo menos uma vez por semana?.1,Q1D - Quantos dias por semana o(a) Sr.(a) costumava praticar exercício físico ou esporte?.1,"Q1E - No dia que o(a) Sr.(a) praticava exercício ou esporte, quanto tempo durava esta atividade?.1","Q2 - Nos últimos três meses, o(a) Sr.(a) trabalhava?.1","Q2B - No seu trabalho, o(a) Sr.(a) andava bastante a pé?.1","Q2C - No seu trabalho, o(a) Sr.(a) carregava peso ou fazia outra atividade pesada?.1","Q2D - Em uma semana normal, em quantos dias o(a) Sr.(a) fazia essas atividades no seu trabalho?.1","Q2E - Quando realizava essas atividades, quanto tempo costumava durar? (minutos).1","Q3 - Para ir ou voltar ao seu trabalho, fazia algum trajeto a pé ou de bicicleta?.1","Q3A-Sim, parte do trajeto.1","Q4 - Anteriormente, o(a) Sr.(a) estava frequentando algum curso/escola ou levava alguém em algum curso/escola?.1","Q4B - Para ir ou voltar a este curso ou escola, fazia algum trajeto a pé ou de bicicleta?.1",Q4C - Quanto tempo o(a) Sr.(a) gastava para ir e voltar neste trajeto (a pé ou de bicicleta)?.1,Q5 - Quem costumava fazer a faxina da sua casa?.1,Q5B - A parte mais pesada da faxina ficava com:.1,"Q5C - Em uma semana normal, em quantos dias o(a) Sr.(a) realizava faxina da sua casa?.1",Q5D - E quanto tempo costumava durar a faxina? (minutos).1,"Q6 - Em média, quantas horas por dia o(a) Sr.(a) costumava ficar assistindo à televisão?.1","Q6B - No seu TEMPO LIVRE, o(a) Sr.(a) costumava usar computador, tablet ou celular para participar de redes sociais do tipo Facebook, para ver filmes ou para se distrair com jogos?.1","Q6B - Em média, quantas horas do seu tempo livre (excluindo o trabalho), este uso do computador, tablet ou celular ocupava por dia?.1","1 - Sou calmo(a), ponderado(a) e senhor(a) de mim mesmo(a).",2 - Preocupo-me demais com coisas sem importância.,3 - Sinto-me seguro(a).,4 - Fico tenso(a) e perturbado(a) quando penso em meus problemas do momento.,5 - Sinto-me nervoso(a) e inquieto(a).,6 - Tomo decisões facilmente.,ANSIEDADE TRACO.1,1 - Me sentia calmo(a).,2 - Estava tenso(a).,3 - Me sentia à vontade.,4 - Me sentia nervoso(a).,5 - Estava descontraído(a).,6 - Estava preocupado(a).,ANSIEDADE ESTADO ANTES.1,1 - Sinto-me calmo(a).,2 - Estou tenso(a).,3 - Sinto-me à vontade.,4 - Sinto-me nervoso(a).,5 - Estou descontraído(a).,6 - Estou preocupado(a).,ANSIEDADE ESTADO DURANTE.1
,,1 Masc,,,1 EnsMédioCompleto,1 Sim,1 Não,1 Doença cardíaca/hipertensão,,,,1 Sim,1 Caminhada,1 Sim,1 1 a 2 dias por semana,1 Entre 30 e 39 minutos,1 Sim,1 Sim,1 Sim,1 2 dias na semana,,1 Sim,1 Menos de 10 minutos,1Sim,1 Sim,1 Menos de 10 minutos,"1 Eu, sozinho",1 O(A) Sr.(a),1 1 dia na semana,,1 Menos de 1 hora,1 Sim,1 Menos de 1 hora,1 Sim,1 Caminhada,1 Sim,1 1 a 2 dias por semana,1 Entre 30 e 39 minutos,1 Sim,1 Sim,1 Sim,1 2 dias na semana,,1 Sim,1 Menos de 10 minutos,1Sim,1 Sim,1 Menos de 10 minutos,"1 Eu, sozinho",1 O(A) Sr.(a),1 1 dia na semana,,1 Menos de 1 hora,1 Sim,1 Menos de 1 hora,,,,,,,,,,,,,,,,,,,,,
,,2 Fem,,,2 EnsSuperiorIncompleto,2 Não,2 Sim,2 Doença pulmonar/respiratória    ,,,,2 Não,2 Musculacao,2 Não,2 3 a 4 dias por semana,2 Entre 50 e 59 minutos,2 Não,2 Não,2 Não,2 4 dias na semana,,2 Não,2 Entre 30 e 39 minutos,2 Nao,2 Não,2 Entre 10 e 19 minutos,"2 Eu, com outra pessoa",2 Outra pessoa,2 2 dias na semana,,2 Entre 2 e 3 horas,2 Não,2 Entre 2 e 3 horas,2 Não,2 Musculacao,2 Não,2 3 a 4 dias por semana,2 Entre 50 e 59 minutos,2 Não,2 Não,2 Não,2 4 dias na semana,,2 Não,2 Entre 30 e 39 minutos,2 Nao,2 Não,2 Entre 10 e 19 minutos,"2 Eu, com outra pessoa",2 Outra pessoa,2 2 dias na semana,,2 Entre 2 e 3 horas,2 Não,2 Entre 2 e 3 horas,,,,,,,,,,,,,,,,,,,,,
,,,,,3 EnsSuperiorCompleto,,3 Prefiro não dizer,3 Diabetes,,,,,3 Artes Marciais/Lutas,,3 5 a 6 dias por semana,3 60 minutos ou mais,,,,3 5 dias na semana,,,3 Entre 50 e 59 minutos,3 Não quis informar,"3 Sim, parte do trajeto",3 Acima de 20 minutos,3 Outra pessoa,3 Ambos,3 5 dias na semana,,3 Entre 3 e 4 horas,,3 Entre 3 e 4 horas,,3 Artes Marciais/Lutas,,3 5 a 6 dias por semana,3 60 minutos ou mais,,,,3 5 dias na semana,,,3 Entre 50 e 59 minutos,3 Não quis informar,"3 Sim, parte do trajeto",3 Acima de 20 minutos,3 Outra pessoa,3 Ambos,3 5 dias na semana,,3 Entre 3 e 4 horas,,3 Entre 3 e 4 horas,,,,,,,,,,,,,,,,,,,,,
,,,,,,,,"4 Imunodepressão, Doença Neurológica/Renal)",,,,,4 Esportes coletivos,,,,,,,4 Não quero responder,,,,,,,,,4 Menos de 1 vez por semana,,4 Mais de 6 horas,,4 Entre 5 e 6 horas,,4 Esportes coletivos,,,,,,,4 Não quero responder,,,,,,,,,4 Menos de 1 vez por semana,,4 Mais de 6 horas,,4 Entre 5 e 6 horas,,,,,,,,,,,,,,,,,,,,,
,,,,,,,,,,,,,5 Bicicleta,,,,,,,,,,,,,,,,,,5 Não assiste televisão,,,,5 Bicicleta,,,,,,,,,,,,,,,,,,5 Não assiste televisão,,,,,,,,,,,,,,,,,,,,,,,
,,,,,,,,,,,,,6  Ginastica/Dança,,,,,,,,,,,,,,,,,,,,,,6  Ginastica/Dança,,,,,,,,,,,,,,,,,,,,,,,,,,,,,,,,,,,,,,,,,
,,,,,,,,,,,,,7 Natação/Hidroginastica,,,,,,,,,,,,,,,,,,,,,,7 Natação/Hidroginastica,,,,,,,,,,,,,,,,,,,,,,,,,,,,,,,,,,,,,,,,,
,,,,,,,,,,,,,8 Atividades alternativas,,,,,,,,,,,,,,,,,,,,,,8 Atividades alternativas,,,,,,,,,,,,,,,,,,,,,,,,,,,,,,,,,,,,,,,,,
,,,,,,,,,,,,,9 Corrida,,,,,,,,,,,,,,,,,,,,,,,,,,,,,,,,,,,,,,,,,,,,,,,,,,,,,,,,,,,,,,,
,,,,,,,,,,,,,,,,,,,,,,,,,,,,,,,,,,,,,,,,,,,,,,,,,,,,,,,,,,,,,,,,,,,,,,,,,,,,
1.0,41.0,1,95.0,Não respondeu,3,1,2,,11.0,7.0,15.0,1,"1, 8",1,2,3,2,1,1,3,480.0,1,2,1,2,1,3,2,4,,1,1,2,1,1,1,2,3,2,1,1,3,480.0,1,2,1,2,2,3,2,1,60.0,1,1,2,4.0,1.0,1.0,1.0,1.0,3.0,11.0,1.0,1.0,1.0,1.0,1.0,2.0,7.0,1.0,3.0,3.0,2.0,3.0,3.0,15.0
2.0,75.0,1,78.0,São Caetano do Sul ,3,1,1,1,11.0,17.0,14.0,2,1,2,1,1,2,2,2,4,20.0,2,,2,2,,3,2,4,,2,1,3,2,1,2,,,2,2,2,4,,2,,3,2,,3,2,1,180.0,3,1,3,2.0,1.0,1.0,2.0,2.0,3.0,11.0,3.0,3.0,3.0,1.0,4.0,3.0,17.0,3.0,2.0,2.0,2.0,2.0,3.0,14.0
3.0,67.0,1,82.0,São Paulo,3,1,2,,13.0,12.0,12.0,1,1,1,2,3,1,2,2,2,180.0,1,2,1,1,3,3,2,4,,3,1,2,1,1,1,2,3,2,2,2,2,180.0,1,3,2,2,1,3,2,4,,3,1,3,2.0,2.0,2.0,3.0,2.0,2.0,13.0,2.0,2.0,2.0,2.0,2.0,2.0,12.0,2.0,2.0,2.0,2.0,2.0,2.0,12.0
4.0,71.0,2,37.0,Ibiuna ,3,2,1,1,10.0,12.0,12.0,1,1,1,2,1,2,,,,,,,1,3,3,3,2,1,,3,1,3,1,1,1,3,1,2,,,,,,,2,,,2,1,3,60.0,2,1,2,2.0,2.0,1.0,2.0,2.0,1.0,10.0,2.0,2.0,2.0,2.0,2.0,2.0,12.0,2.0,2.0,2.0,2.0,2.0,2.0,12.0
5.0,32.0,2,16.0,Campinas,3,1,2,,19.0,16.0,20.0,1,"1, 6",1,2,2,1,2,2,,,1,1,2,,,2,2,1,60.0,2,1,2,1,1,1,3,1,1,2,2,,,2,,2,,,2,2,1,60.0,2,1,2,3.0,4.0,3.0,3.0,2.0,4.0,19.0,2.0,3.0,3.0,2.0,3.0,3.0,16.0,3.0,3.0,3.0,3.0,4.0,4.0,20.0
6.0,43.0,1,74.0,Santana de Parnaiba ,3,1,1,1,15.0,13.0,14.0,1,2,1,2,2,1,1,2,,,2,,1,2,,2,1,2,120.0,2,1,2,1,1,1,3,1,1,2,2,,,2,,2,,,2,1,3,120.0,3,1,2,2.0,3.0,2.0,3.0,3.0,2.0,15.0,2.0,2.0,1.0,2.0,3.0,3.0,13.0,3.0,2.0,2.0,2.0,3.0,2.0,14.0
7.0,36.0,2,64.0,Recife,3,1,2,,13.0,12.0,15.0,1,"5, 4",1,1,3,1,1,2,,,3,3,1,2,,3,,,,2,1,2,1,1,1,1,1,1,2,2,,,2,,2,,,1,1,3,120.0,2,1,3,2.0,2.0,2.0,2.0,2.0,3.0,13.0,2.0,2.0,2.0,2.0,2.0,2.0,12.0,2.0,2.0,2.0,2.0,3.0,4.0,15.0
8.0,56.0,1,12.0,Bom Jesus dos Perdões,3,2,2,,16.0,14.0,13.0,1,1,2,3,1,2,,,,,,,2,,,2,3,3,120.0,3,1,2,1,1,1,3,1,2,,,,,,,2,,,2,3,3,120.0,3,1,2,2.0,3.0,2.0,4.0,2.0,3.0,16.0,2.0,2.0,2.0,2.0,3.0,3.0,14.0,3.0,2.0,2.0,2.0,2.0,2.0,13.0
9.0,60.0,2,11.0,Boituva,3,2,2,,13.0,12.0,21.0,1,"1, 2, 6, 5",1,3,3,2,,,,,,,1,2,,1,1,1,360.0,2,1,2,1,1,1,2,1,2,,,,,,,2,,,1,,3,120.0,3,1,2,2.0,2.0,2.0,3.0,2.0,2.0,13.0,2.0,2.0,2.0,2.0,2.0,2.0,12.0,4.0,3.0,4.0,3.0,4.0,3.0,21.0
10.0,49.0,1,38.0,Indaiatuba,3,1,2,,14.0,13.0,11.0,1,1,1,1,3,1,2,2,,,2,,1,2,,3,,,,2,1,2,1,1,1,2,3,1,2,2,,,2,,2,,,2,3,3,120.0,2,1,2,3.0,1.0,2.0,4.0,2.0,2.0,14.0,2.0,2.0,2.0,2.0,3.0,2.0,13.0,2.0,1.0,2.0,2.0,2.0,2.0,11.0
11.0,42.0,2,77.0,São Bernardo do Campo ,2,2,1,1,13.0,14.0,17.0,2,,,,,1,2,2,,,2,,2,,,2,2,4,240.0,2,1,3,1,1,1,2,1,2,,,,,,,2,,,2,1,2,180.0,4,1,4,2.0,3.0,2.0,2.0,2.0,2.0,13.0,3.0,4.0,1.0,2.0,2.0,2.0,14.0,2.0,2.0,3.0,3.0,3.0,4.0,17.0
12.0,52.0,1,43.0,Jaboatão dos Guararapes ,3,1,2,,8.0,15.0,9.0,1,4,1,3,3,1,1,2,2,90.0,3,2,1,3,1,3,2,4,,5,1,1,1,1,1,3,3,2,2,2,4,,2,1,2,2,1,2,2,3,180.0,5,1,1,1.0,1.0,1.0,2.0,2.0,1.0,8.0,2.0,2.0,3.0,2.0,4.0,2.0,15.0,1.0,1.0,1.0,2.0,2.0,2.0,9.0
13.0,53.0,2,67.0,Ribeirão Preto,3,1,2,,11.0,9.0,9.0,1,1,1,1,1,1,2,2,4,,3,1,2,,,2,3,2,180.0,3,1,2,1,1,1,1,1,1,2,2,1,30.0,1,1,2,,,2,3,2,180.0,3,1,3,2.0,2.0,2.0,2.0,1.0,2.0,11.0,2.0,2.0,1.0,1.0,2.0,1.0,9.0,1.0,2.0,2.0,1.0,2.0,1.0,9.0
14.0,48.0,2,82.0,São Paulo ,3,1,2,,8.0,13.0,12.0,1,"1, 6",1,2,2,1,2,2,,,1,2,2,,,2,2,,,2,1,2,1,1,1,2,1,1,2,2,,,2,,2,,,1,,1,180.0,1,1,2,1.0,1.0,2.0,2.0,1.0,1.0,8.0,2.0,2.0,2.0,2.0,2.0,3.0,13.0,3.0,2.0,2.0,1.0,2.0,2.0,12.0
15.0,46.0,2,78.0,São Caetano do Sul   ,2,2,2,,17.0,13.0,20.0,1,1,1,2,1,2,,,,,,,2,,,1,,1,240.0,3,1,4,1,1,1,1,1,2,,,,,,,2,,,1,1,1,240.0,3,1,4,2.0,3.0,3.0,4.0,3.0,2.0,17.0,3.0,2.0,2.0,2.0,2.0,2.0,13.0,3.0,3.0,3.0,3.0,4.0,4.0,20.0
16.0,29.0,2,52.0,Mauá ,3,1,2,,12.0,9.0,23.0,1,"2, 6, 7",1,2,3,1,2,2,,,2,,2,,,2,3,1,360.0,2,1,2,1,1,2,1,2,1,2,2,,,2,,2,,,2,3,1,360.0,4,1,2,2.0,2.0,2.0,3.0,1.0,2.0,12.0,2.0,2.0,1.0,1.0,1.0,2.0,9.0,4.0,4.0,4.0,3.0,4.0,4.0,23.0
17.0,45.0,2,82.0,São Paulo  ,3,2,2,,17.0,14.0,18.0,2,1,1,1,2,1,1,2,4,,1,1,2,2,1,2,2,,360.0,1,1,2,1,1,2,1,2,1,3,2,,,2,,2,2,,2,2,,360.0,1,1,2,3.0,2.0,3.0,3.0,3.0,3.0,17.0,3.0,2.0,3.0,2.0,2.0,2.0,14.0,3.0,3.0,3.0,3.0,3.0,3.0,18.0
18.0,49.0,2,82.0,São Paulo   .,3,1,2,,13.0,12.0,17.0,1,2,1,1,2,1,2,2,,,3,1,2,,,3,,,,2,1,2,1,1,1,1,2,2,,,,,,,2,,,2,1,1,390.0,3,1,3,2.0,2.0,2.0,3.0,2.0,2.0,13.0,2.0,2.0,2.0,2.0,2.0,2.0,12.0,3.0,3.0,3.0,2.0,3.0,3.0,17.0
19.0,48.0,2,18.0,Campo Largo,3,2,2,,11.0,12.0,15.0,1,1,1,1,2,2,2,2,4,,2,,2,2,,1,1,2,420.0,3,1,2,1,1,1,1,2,2,2,2,,,,,2,2,,1,1,2,420.0,2,1,2,1.0,2.0,2.0,2.0,2.0,2.0,11.0,1.0,2.0,3.0,2.0,2.0,2.0,12.0,3.0,2.0,3.0,2.0,3.0,2.0,15.0
20.0,21.0,2,85.0,Sorocaba   ,3,1,1,2,12.0,9.0,13.0,1,1,1,2,2,1,2,2,,,3,1,1,2,,2,2,2,60.0,1,1,2,1,1,2,1,1,1,2,2,,,2,,2,,,2,2,3,60.0,3,1,3,2.0,2.0,3.0,2.0,1.0,2.0,12.0,2.0,2.0,1.0,2.0,1.0,1.0,9.0,2.0,2.0,2.0,2.0,2.0,3.0,13.0
21.0,20.0,1,82.0,São Paulo ,2,1,2,,15.0,14.0,16.0,1,"1, 4",1,2,1,2,,,,,,,1,3,1,2,2,1,10.0,2,1,2,1,1,1,2,1,2,,,,,,,2,,,2,2,2,15.0,3,1,2,3.0,3.0,1.0,3.0,3.0,2.0,15.0,3.0,3.0,3.0,1.0,1.0,3.0,14.0,3.0,2.0,2.0,3.0,3.0,3.0,16.0
22.0,55.0,1,92.0,Vargem grande Paulista. ,3,2,1,3.1,12.0,12.0,12.0,1,1,1,2,1,1,1,2,,,2,,2,,,2,3,3,120.0,2,1,2,1,1,1,2,1,1,2,2,,,2,,2,,,2,3,3,120.0,2,1,2,2.0,1.0,3.0,2.0,2.0,2.0,12.0,2.0,2.0,2.0,2.0,2.0,2.0,12.0,2.0,2.0,2.0,2.0,2.0,2.0,12.0
23.0,48.0,2,95.0,Não respondeu,3,2,2,,12.0,7.0,12.0,1,1,1,2,1,1,2,2,,,2,,1,2,,3,,,,3,1,2,1,1,1,2,1,2,,,,,,,2,,,1,3,3,120.0,3,1,3,2.0,3.0,2.0,2.0,2.0,1.0,12.0,2.0,1.0,1.0,1.0,1.0,1.0,7.0,2.0,2.0,2.0,2.0,2.0,2.0,12.0
24.0,32.0,2,82.0,São Paulo ,3,1,2,,15.0,16.0,18.0,1,"1, 9, 2",1,3,2,1,2,2,,,2,,2,,,2,3,2,120.0,2,1,2,1,1,1,2,2,1,2,2,,,2,,2,,,2,3,2,120.0,4,1,3,2.0,4.0,2.0,3.0,3.0,1.0,15.0,3.0,3.0,3.0,2.0,3.0,2.0,16.0,3.0,3.0,3.0,3.0,3.0,3.0,18.0
25.0,56.0,2,82.0,São Paulo ,3,1,1,1,14.0,13.0,12.0,1,"1, 7, 6",1,2,3,2,,,,,,,2,,,2,2,1,60.0,3,1,2,1,1,1,2,2,2,,,,,,,2,,,1,1,3,120.0,4,1,2,3.0,3.0,2.0,2.0,2.0,2.0,14.0,3.0,2.0,2.0,2.0,2.0,2.0,13.0,2.0,2.0,2.0,2.0,2.0,2.0,12.0
26.0,70.0,1,37.0,Ibiuna,3,2,1,1,13.0,6.0,8.0,2,,,,,1,2,2,,,2,,2,,,3,,,,3,1,2,1,1,1,3,1,1,2,2,,,2,,2,,,2,2,4,120.0,3,1,3,2.0,4.0,2.0,2.0,1.0,2.0,13.0,1.0,1.0,1.0,1.0,1.0,1.0,6.0,1.0,1.0,1.0,1.0,1.0,3.0,8.0
27.0,60.0,2,82.0,São Paulo ,3,1,2,,13.0,15.0,15.0,1,1,1,1,1,1,1,2,3,180.0,3,2,2,2,,1,3,1,240.0,2,1,2,2,1,1,1,1,1,2,2,3,360.0,2,2,2,2,3,2,2,3,120.0,3,1,4,2.0,2.0,2.0,3.0,2.0,2.0,13.0,3.0,2.0,3.0,2.0,3.0,2.0,15.0,3.0,3.0,2.0,2.0,2.0,3.0,15.0
28.0,62.0,2,63.0,Praia Grande,3,1,1,3.2,14.0,13.0,14.0,1,1,1,3,3,2,,,,,,,1,1,3,1,1,3,150.0,3,1,3,1,1,1,1,3,2,,,,,,,2,,,1,1,3,120.0,3,1,3,3.0,2.0,3.0,3.0,2.0,1.0,14.0,3.0,2.0,2.0,2.0,2.0,2.0,13.0,3.0,2.0,2.0,2.0,2.0,3.0,14.0
29.0,36.0,2,82.0,São Paulo ,3,1,1,1.2,12.0,8.0,7.0,1,"6, 7",1,2,3,1,1,2,,,1,1,1,1,2,2,2,2,180.0,2,1,1,1,1,1,3,3,1,1,2,,,1,1,1,1,2,2,2,2,180.0,2,1,1,1.0,2.0,3.0,2.0,2.0,2.0,12.0,1.0,1.0,2.0,1.0,2.0,1.0,8.0,2.0,1.0,1.0,1.0,1.0,1.0,7.0
30.0,41.0,2,82.0,São Paulo,3,2,2,,15.0,13.0,17.0,1,1,1,2,2,1,2,2,,,3,1,2,,,2,2,1,180.0,3,1,2,1,1,1,1,1,2,,,,,,,2,,,2,1,2,180.0,4,1,3,3.0,2.0,2.0,3.0,2.0,3.0,15.0,3.0,2.0,2.0,2.0,2.0,2.0,13.0,3.0,3.0,3.0,2.0,3.0,3.0,17.0
31.0,61.0,2,78.0,São Caetano do Sul ,3,1,2,,13.0,17.0,15.0,1,"1, 4",1,2,3,1,1,2,,,3,2,2,,,2,1,3,360.0,3,1,1,1,1,1,3,1,2,,,4,,,,2,2,3,2,1,3,180.0,3,1,2,3.0,1.0,2.0,3.0,2.0,2.0,13.0,3.0,2.0,4.0,2.0,3.0,3.0,17.0,3.0,2.0,2.0,2.0,3.0,3.0,15.0
32.0,58.0,2,82.0,São Paulo ,1,1,1,2,22.0,15.0,15.0,1,1,1,1,2,1,1,2,,,2,,2,,,2,3,1,120.0,2,1,2,1,1,1,1,2,2,,,,,,,2,,,1,1,3,180.0,2,1,2,3.0,4.0,4.0,4.0,4.0,3.0,22.0,3.0,2.0,3.0,2.0,3.0,2.0,15.0,4.0,1.0,3.0,2.0,3.0,2.0,15.0
33.0,25.0,2,82.0,São Paulo ,3,1,2,,17.0,12.0,18.0,1,6,1,1,1,1,1,2,,,1,2,1,2,,3,,,,1,1,2,1,1,1,1,1,2,,,,,,,2,,,2,3,3,180.0,2,1,3,2.0,3.0,2.0,3.0,3.0,4.0,17.0,2.0,2.0,2.0,2.0,2.0,2.0,12.0,3.0,3.0,3.0,3.0,4.0,2.0,18.0
34.0,62.0,2,77.0,São Bernardo do Campo ,3,1,2,,13.0,19.0,13.0,1,1,1,1,2,1,1,2,,,2,,1,2,,3,,,,2,1,2,1,1,1,1,2,1,2,2,,,2,,2,,,1,,2,180.0,3,1,4,2.0,1.0,2.0,3.0,2.0,3.0,13.0,4.0,1.0,4.0,2.0,4.0,4.0,19.0,2.0,2.0,3.0,2.0,2.0,2.0,13.0
35.0,22.0,1,75.0,Santo André ,2,1,2,,13.0,9.0,23.0,1,"1, 9, 2, 4",1,3,3,1,1,2,3,,1,1,2,,,2,3,1,180.0,1,1,2,1,1,1,1,2,2,,,,,,,3,,,2,3,3,180.0,4,1,3,2.0,2.0,2.0,2.0,2.0,3.0,13.0,2.0,1.0,2.0,2.0,1.0,1.0,9.0,4.0,4.0,3.0,4.0,4.0,4.0,23.0
36.0,43.0,1,17.0,Campo Grande ,3,2,2,,12.0,15.0,15.0,1,1,1,1,2,1,2,2,,,2,,2,,,1,1,1,240.0,2,1,3,1,1,1,1,2,1,2,2,,,2,,2,,,1,,1,240.0,3,1,3,3.0,2.0,2.0,2.0,2.0,1.0,12.0,3.0,2.0,3.0,2.0,3.0,2.0,15.0,3.0,2.0,3.0,2.0,3.0,2.0,15.0
37.0,60.0,1,38.0,Indaiatuba ,1,1,1,1,10.0,10.0,14.0,1,"1, 6",1,1,2,1,2,2,,,1,1,2,,,2,3,1,300.0,2,1,1,1,1,1,3,3,2,,,,,,,2,,,2,3,2,300.0,3,1,2,2.0,1.0,3.0,1.0,1.0,2.0,10.0,1.0,1.0,2.0,1.0,4.0,1.0,10.0,2.0,3.0,2.0,2.0,4.0,1.0,14.0
38.0,57.0,2,42.0,Itu,3,1,2,,11.0,18.0,12.0,1,"1, 6",1,2,2,1,2,2,,,2,,1,2,,2,2,,,3,1,2,1,1,1,2,2,1,2,2,,,2,,2,,,2,2,2,480.0,4,1,2,2.0,2.0,1.0,3.0,2.0,1.0,11.0,2.0,2.0,4.0,2.0,4.0,4.0,18.0,2.0,1.0,2.0,1.0,3.0,3.0,12.0
39.0,59.0,1,82.0,São Paulo    ,3,2,1,1,9.0,9.0,9.0,1,1,1,2,1,1,1,,,,2,,2,,,2,3,1,120.0,2,1,2,1,1,1,2,2,1,1,2,,,2,,2,,,2,3,1,120.0,2,1,2,1.0,1.0,1.0,2.0,1.0,3.0,9.0,2.0,1.0,2.0,1.0,2.0,1.0,9.0,2.0,1.0,2.0,1.0,2.0,1.0,9.0
40.0,47.0,2,55.0,Osasco São Paulo ,3,1,1,1,12.0,9.0,18.0,1,7,1,1,2,2,2,2,4,40.0,,,2,2,,3,2,4,,2,1,3,1,1,2,,,2,2,2,,,2,,2,,,2,2,,,2,1,3,1.0,2.0,2.0,3.0,3.0,1.0,12.0,2.0,3.0,1.0,1.0,1.0,1.0,9.0,3.0,3.0,3.0,2.0,3.0,4.0,18.0
41.0,51.0,1,82.0,São Paulo,3,2,1,1,8.0,12.0,12.0,1,1,2,2,1,1,2,2,,,3,1,2,,,3,,,,2,1,2,1,1,,2,1,1,2,2,,,3,1,2,,,3,2,,,2,1,2,1.0,2.0,1.0,1.0,1.0,2.0,8.0,3.0,2.0,1.0,1.0,4.0,1.0,12.0,2.0,2.0,2.0,2.0,2.0,2.0,12.0
42.0,56.0,2,82.0,São Paulo ,3,2,1,1,11.0,14.0,15.0,1,1,1,1,2,1,1,2,,,2,,1,2,,3,,,,3,1,2,1,1,1,1,2,2,,,,,,,2,,,2,2,3,,2,1,2,2.0,2.0,2.0,2.0,1.0,2.0,11.0,2.0,1.0,2.0,1.0,4.0,4.0,14.0,2.0,2.0,4.0,2.0,3.0,2.0,15.0
43.0,21.0,2,94.0,Vinhedo ,2,1,1,4,16.0,10.0,17.0,1,"1, 6",1,1,3,1,2,2,,,2,,1,3,2,3,2,,,1,1,3,1,1,1,2,2,1,2,2,,,2,,1,2,,3,2,,,2,1,3,3.0,3.0,1.0,4.0,3.0,2.0,16.0,3.0,2.0,1.0,1.0,1.0,2.0,10.0,3.0,3.0,3.0,2.0,3.0,3.0,17.0
44.0,57.0,2,68.0,Rio das Pedras,3,1,2,,16.0,14.0,15.0,1,1,1,2,1,2,2,2,3,35.0,2,,1,2,,3,,,,2,2,,1,1,1,2,1,2,,,,,,,2,,,3,2,,,2,2,1,3.0,2.0,2.0,3.0,4.0,2.0,16.0,3.0,2.0,2.0,2.0,2.0,3.0,14.0,4.0,1.0,4.0,1.0,4.0,1.0,15.0
45.0,23.0,1,77.0,São Bernardo do Campo   ,3,1,2,,9.0,13.0,20.0,1,1,1,1,2,1,2,2,,,1,3,2,,,3,,,,2,1,4,1,1,1,3,1,1,2,2,,,2,,2,,,3,,,,2,1,4,1.0,2.0,2.0,2.0,1.0,1.0,9.0,3.0,2.0,2.0,2.0,2.0,2.0,13.0,4.0,4.0,3.0,3.0,2.0,4.0,20.0
46.0,36.0,1,29.0,Franco da Rocha,2,1,2,,10.0,19.0,11.0,1,"1, 2",1,3,2,1,2,2,,,2,,1,2,,3,,,,2,1,3,1,1,1,2,2,1,2,2,,,2,,2,2,,3,,,,2,1,3,2.0,2.0,1.0,2.0,2.0,1.0,10.0,3.0,3.0,4.0,2.0,4.0,3.0,19.0,2.0,2.0,2.0,1.0,2.0,2.0,11.0
47.0,48.0,2,78.0,São Caetano do Sul  São Paulo,3,1,2,,14.0,14.0,16.0,1,1,,1,2,1,2,2,,,2,,2,,,3,,,,3,1,4,1,1,1,1,2,1,2,2,,,2,,2,,,3,,,,3,1,3,2.0,2.0,2.0,4.0,2.0,2.0,14.0,3.0,2.0,2.0,2.0,3.0,2.0,14.0,3.0,1.0,3.0,2.0,4.0,3.0,16.0
48.0,48.0,2,78.0,São Caetano do Sul ,3,2,2,,14.0,12.0,13.0,1,1,1,3,3,1,2,1,3,120.0,2,,2,,,3,,,,2,1,3,1,1,1,3,3,1,2,1,3,120.0,2,,2,,,3,,,,2,1,2,2.0,2.0,2.0,3.0,2.0,3.0,14.0,2.0,2.0,2.0,2.0,2.0,2.0,12.0,2.0,2.0,2.0,2.0,3.0,2.0,13.0
49.0,61.0,1,82.0,São Paulo  ,3,2,2,,8.0,9.0,9.0,1,1,1,2,2,1,2,2,,,3,1,2,,,3,,,,2,1,2,1,1,1,2,2,1,2,2,,,3,1,2,,,3,,,,2,1,2,1.0,1.0,2.0,2.0,1.0,1.0,8.0,2.0,1.0,1.0,1.0,2.0,2.0,9.0,2.0,1.0,2.0,1.0,1.0,2.0,9.0
50.0,47.0,1,82.0,São Paulo ,3,1,2,,12.0,13.0,17.0,1,"1, 2",1,1,2,1,1,2,3,60.0,3,3,2,2,1,3,,,,2,1,2,1,1,1,2,3,1,2,2,,,2,,2,,,3,,,,2,1,2,1.0,2.0,2.0,3.0,3.0,1.0,12.0,2.0,3.0,2.0,2.0,2.0,2.0,13.0,2.0,3.0,3.0,3.0,3.0,3.0,17.0
51.0,24.0,2,94.0,Vinhedo ,3,1,3,,19.0,12.0,19.0,1,"1, 2",1,2,3,1,3,1,3,240.0,2,,2,,,3,,,,2,1,4,1,1,2,,,1,2,2,4,,2,,2,,,2,2,,,2,1,4,2.0,4.0,2.0,4.0,4.0,3.0,19.0,2.0,2.0,2.0,2.0,1.0,3.0,12.0,3.0,3.0,3.0,3.0,3.0,4.0,19.0
52.0,64.0,2,25.0,Florianopolis,2,1,3,,7.0,11.0,9.0,1,"1, 2, 6",1,2,2,1,1,2,,,1,1,2,,,1,,3,,2,1,2,1,1,1,2,1,1,1,1,3,,1,1,2,,,1,1,3,,2,1,2,2.0,1.0,1.0,1.0,1.0,1.0,7.0,2.0,2.0,1.0,1.0,3.0,2.0,11.0,1.0,1.0,4.0,1.0,1.0,1.0,9.0
53.0,52.0,2,82.0,São Paulo ,3,2,2,,6.0,12.0,9.0,2,,,,,2,,,,,,,1,2,,2,2,,,3,1,3,1,1,1,1,1,2,,,,,,,2,,,2,3,1,120.0,3,1,3,1.0,1.0,1.0,1.0,1.0,1.0,6.0,4.0,2.0,1.0,2.0,1.0,2.0,12.0,2.0,1.0,2.0,1.0,2.0,1.0,9.0
54.0,18.0,1,16.0,Campinas,2,1,2,,17.0,17.0,17.0,1,"1, 9, 2, 5",1,3,3,2,,,,,,,1,3,2,2,3,1,360.0,1,1,3,1,"1, 2, 5",1,3,3,2,,,,,,,1,3,2,2,3,1,360.0,1,1,3,2.0,4.0,1.0,4.0,4.0,2.0,17.0,3.0,3.0,3.0,4.0,2.0,2.0,17.0,3.0,3.0,3.0,4.0,2.0,2.0,17.0
55.0,66.0,1,78.0,São Caetano do sul   ,3,1,2,,11.0,7.0,12.0,1,"1, 9, 6",1,2,2,2,,,,,,,2,,,3,,,,3,1,3,1,"1, 6",1,2,2,2,,,,,,,2,,,3,,,,3,1,3,1.0,3.0,1.0,2.0,2.0,2.0,11.0,1.0,1.0,1.0,1.0,1.0,2.0,7.0,2.0,2.0,2.0,2.0,2.0,2.0,12.0
56.0,21.0,2,38.0,Indaiatuba,2,1,2,,19.0,17.0,18.0,1,"1, 2, 5",1,2,2,1,1,2,,,2,,1,2,,2,3,2,120.0,1,1,2,1,"1, 2, 5",1,2,2,1,1,2,,,2,,2,,,3,3,3,30.0,2,1,3,2.0,4.0,3.0,3.0,3.0,4.0,19.0,3.0,2.0,3.0,3.0,3.0,3.0,17.0,3.0,3.0,3.0,3.0,3.0,3.0,18.0
57.0,19.0,2,16.0,CampinasSão Paulo,1,1,1,2,17.0,16.0,20.0,1,"1, 9, 2, 6, 7, 3, 5",1,3,2,1,2,2,,,3,1,1,2,,2,3,1,,1,1,3,1,"1, 2, 6, 5",1,3,2,1,2,2,,,3,1,1,3,1,2,3,3,180.0,3,1,4,3.0,4.0,1.0,4.0,3.0,2.0,17.0,3.0,3.0,2.0,3.0,2.0,3.0,16.0,3.0,4.0,2.0,4.0,3.0,4.0,20.0
58.0,14.0,1,78.0,São Caetano ,1,2,2,,16.0,12.0,15.0,1,"9, 3, 4",1,2,3,2,,,,,,,1,1,3,2,3,3,120.0,3,1,4,1,"1, 6",1,3,3,2,,,,,,,1,2,,2,3,3,120.0,3,1,4,3.0,4.0,3.0,2.0,3.0,1.0,16.0,2.0,2.0,2.0,1.0,3.0,2.0,12.0,2.0,2.0,2.0,3.0,3.0,3.0,15.0
59.0,30.0,1,82.0,São Paulo ,2,1,2,,10.0,15.0,9.0,1,"1, 9, 2",1,3,3,1,2,1,3,30.0,1,1,1,3,1,2,,,120.0,2,1,4,1,"1, 9, 2",1,3,3,1,2,1,3,60.0,3,1,1,3,1,2,3,1,120.0,2,1,4,2.0,3.0,1.0,2.0,1.0,1.0,10.0,1.0,3.0,3.0,2.0,2.0,4.0,15.0,1.0,1.0,1.0,2.0,2.0,2.0,9.0
60.0,55.0,1,75.0,Santo André ,3,1,2,,9.0,13.0,16.0,1,"1, 9, 2, 6",1,3,3,2,,,,,,,1,1,3,1,,1,60.0,3,1,2,1,"1, 9, 2, 6",1,3,3,2,,,,,,,2,2,,1,1,1,60.0,3,1,2,1.0,1.0,2.0,2.0,2.0,1.0,9.0,2.0,1.0,3.0,2.0,3.0,2.0,13.0,4.0,2.0,4.0,1.0,3.0,2.0,16.0
61.0,31.0,1,82.0,São PauloSão Paulo  ,3,2,2,,10.0,11.0,10.0,1,"1, 9, 2, 6, 4",1,3,1,1,1,2,,,1,1,1,2,,2,2,,,2,1,2,1,"1, 9, 2, 6, 4",1,3,2,1,1,2,,,1,1,1,1,1,2,2,,,2,1,2,2.0,1.0,2.0,2.0,1.0,2.0,10.0,2.0,2.0,2.0,1.0,2.0,2.0,11.0,2.0,2.0,2.0,1.0,2.0,1.0,10.0
62.0,24.0,2,26.0,Fort Wayne  EUA ,3,2,2,,22.0,21.0,15.0,1,"1, 9, 2",1,2,2,1,1,1,3,540.0,1,2,2,,,1,,2,30.0,2,1,2,1,"1, 9, 2",1,2,2,1,1,1,3,540.0,1,2,2,,,1,,1,30.0,2,1,2,3.0,4.0,3.0,4.0,4.0,4.0,22.0,3.0,3.0,4.0,4.0,3.0,4.0,21.0,3.0,2.0,3.0,3.0,2.0,2.0,15.0
63.0,40.0,2,82.0,São Paulo,3,1,2,,11.0,16.0,14.0,1,"1, 2",1,4,3,1,1,2,,,2,,1,2,,2,2,,,4,1,2,1,"1, 2",1,2,3,1,2,2,,,2,,2,,,1,,2,180.0,3,1,4,1.0,2.0,2.0,3.0,1.0,2.0,11.0,3.0,2.0,3.0,2.0,3.0,3.0,16.0,3.0,2.0,2.0,2.0,2.0,3.0,14.0
64.0,41.0,2,23.0,Curitiba,3,1,2,,13.0,14.0,14.0,2,,,,,1,1,2,,,3,1,1,2,,2,1,2,360.0,2,1,2,1,"1, 2",1,3,3,2,,,,,,,2,,,2,1,2,360.0,5,1,4,2.0,2.0,1.0,3.0,3.0,2.0,13.0,3.0,2.0,2.0,2.0,2.0,3.0,14.0,3.0,2.0,2.0,2.0,2.0,3.0,14.0
65.0,54.0,2,82.0,São Paulo ,3,1,2,,19.0,17.0,17.0,1,"1, 6, 4",1,2,3,1,2,2,,,2,,2,2,,2,3,3,300.0,1,1,2,1,"1, 2",1,2,3,1,2,2,,,2,,2,,,2,1,3,360.0,3,1,2,3.0,2.0,3.0,4.0,4.0,3.0,19.0,3.0,2.0,3.0,4.0,3.0,2.0,17.0,3.0,4.0,1.0,4.0,1.0,4.0,17.0
66.0,31.0,1,82.0,Sao Paulo ,3,1,1,3.1,17.0,15.0,15.0,1,"9, 2",1,2,3,1,2,2,4,,1,1,2,2,,2,3,1,60.0,2,1,4,1,"1, 2",1,2,3,1,2,2,4,,2,,2,2,,2,3,1,60.0,2,1,4,3.0,3.0,2.0,4.0,2.0,3.0,17.0,3.0,2.0,2.0,3.0,2.0,3.0,15.0,3.0,2.0,3.0,2.0,3.0,2.0,15.0
67.0,65.0,1,82.0,São Paulo ,3,1,1,1,15.0,15.0,14.0,1,"1, 2",1,2,3,2,,,,,,,2,,,3,,,,3,1,2,1,"1, 2",1,2,3,2,,,,,,,2,,,3,,,,3,1,2,3.0,3.0,2.0,2.0,3.0,2.0,15.0,3.0,3.0,2.0,2.0,3.0,2.0,15.0,2.0,2.0,3.0,2.0,3.0,2.0,14.0
68.0,30.0,1,82.0,Sao Paulo   ,3,2,2,,10.0,10.0,11.0,1,"9, 2",1,4,2,1,1,1,3,60.0,3,2,2,,,2,2,,,1,1,2,1,"1, 2",1,3,2,1,2,2,3,60.0,2,,2,,,2,2,,,2,1,2,1.0,1.0,3.0,2.0,1.0,2.0,10.0,2.0,1.0,2.0,1.0,3.0,1.0,10.0,2.0,2.0,2.0,1.0,2.0,2.0,11.0
69.0,27.0,1,82.0,São Paulo   ,3,1,2,,10.0,7.0,9.0,1,"2, 4",1,3,2,1,1,1,3,30.0,1,2,2,,,3,,,,1,1,2,1,"1, 2",1,3,2,2,,,,,,,2,,,3,,,,1,1,2,1.0,1.0,2.0,2.0,1.0,3.0,10.0,1.0,1.0,1.0,1.0,2.0,1.0,7.0,2.0,1.0,2.0,1.0,2.0,1.0,9.0
70.0,53.0,2,45.0,Jaraguá do Sul SC,3,1,2,,11.0,13.0,11.0,1,"1, 2",1,2,2,2,2,2,,,,,1,2,,3,2,1,,1,1,3,1,"1, 2",1,1,2,2,,,,,,,2,,,2,2,,,1,1,2,1.0,2.0,2.0,3.0,1.0,2.0,11.0,3.0,2.0,2.0,2.0,2.0,2.0,13.0,2.0,2.0,2.0,1.0,2.0,2.0,11.0
71.0,42.0,1,82.0,São Paulo,3,1,2,,17.0,15.0,17.0,1,2,1,2,3,1,1,2,,,2,,2,,,3,,,,2,1,2,1,"1, 2",1,2,3,1,1,2,,,2,,2,,,3,,,,2,1,2,3.0,4.0,2.0,4.0,2.0,2.0,17.0,3.0,2.0,3.0,2.0,3.0,2.0,15.0,2.0,3.0,3.0,3.0,3.0,3.0,17.0
72.0,21.0,2,16.0,Campinas ,2,1,2,,21.0,18.0,19.0,1,"2, 3",1,3,3,2,,,,,,,1,1,1,2,2,1,240.0,2,1,4,1,"1, 2, 3",1,2,3,2,,,,,,,2,,,2,1,2,240.0,2,1,4,3.0,4.0,4.0,4.0,3.0,3.0,21.0,3.0,3.0,2.0,4.0,3.0,3.0,18.0,3.0,3.0,4.0,3.0,3.0,3.0,19.0